Target
Tyrosine-protein kinase BTK
Ligand
BDBM50039963
Substrate
Meas. Tech.
ChEMBL_1446183 (CHEMBL3371883)
IC50
190±n/a nM
Citation
 Lou, YSweeney, ZKKuglstatter, ADavis, DGoldstein, DMHan, XHong, JKocer, BKondru, RKLitman, RMcIntosh, JSarma, KSuh, JTaygerly, JOwens, TD Finding the perfect spot for fluorine: improving potency up to 40-fold during a rational fluorine scan of a Bruton's Tyrosine Kinase (BTK) inhibitor scaffold. Bioorg Med Chem Lett 25:367-71 (2014)  
Target
Name:
Tyrosine-protein kinase BTK
Synonyms:
AGMX1 Agammaglobulinaemia tyrosine kinase B cell progenitor kinase BPK BTK_HUMAN Tyrosine Kinase BTK Tyrosine-protein kinase BTK (BTK)
Type:
Enzyme
Mol. Mass.:
76289.95
Organism:
Homo sapiens (Human)
Description:
Q06187
Residue:
659
  
Inhibitor
Name:
BDBM50039963
Synonyms:
CHEMBL3358336
Type:
Small organic molecule
Emp. Form.:
C33H36N6O4
Mol. Mass.:
580.6767
SMILES:
CN(C)c1ccc2C(=O)N(CCc2c1)c1cccc(-c2cc(Nc3ccc(cn3)N3CCOCC3)c(=O)n(C)c2)c1CO
: