Target
Tyrosine-protein kinase BTK
Ligand
BDBM50039980
Substrate
Meas. Tech.
ChEMBL_1446183 (CHEMBL3371883)
IC50
400±n/a nM
Citation
 Lou, YSweeney, ZKKuglstatter, ADavis, DGoldstein, DMHan, XHong, JKocer, BKondru, RKLitman, RMcIntosh, JSarma, KSuh, JTaygerly, JOwens, TD Finding the perfect spot for fluorine: improving potency up to 40-fold during a rational fluorine scan of a Bruton's Tyrosine Kinase (BTK) inhibitor scaffold. Bioorg Med Chem Lett 25:367-71 (2014)  
Target
Name:
Tyrosine-protein kinase BTK
Synonyms:
AGMX1 Agammaglobulinaemia tyrosine kinase B cell progenitor kinase BPK BTK_HUMAN Tyrosine Kinase BTK Tyrosine-protein kinase BTK (BTK)
Type:
Enzyme
Mol. Mass.:
76289.95
Organism:
Homo sapiens (Human)
Description:
Q06187
Residue:
659
  
Inhibitor
Name:
BDBM50039980
Synonyms:
CHEMBL3358343
Type:
Small organic molecule
Emp. Form.:
C35H35ClN6O3
Mol. Mass.:
623.144
SMILES:
CN1CCN(CC1)c1ccc(Nc2cc(cn(C)c2=O)-c2cccc(c2CO)-n2ccc3cc(cc(Cl)c3c2=O)C2CC2)nc1
: