Target
C-C chemokine receptor type 3
Ligand
BDBM50041092
Substrate
Meas. Tech.
ChEMBL_1445728 (CHEMBL3374865)
Ki
34±n/a nM
Citation
 Kriegl, JMMartyres, DGrundl, MAAnderskewitz, RDollinger, HRast, GSchmid, BSeither, PTautermann, CS Rodent selectivity of piperidine-4-yl-1H-indoles, a series of CC chemokine receptor-3 (CCR3) antagonists: insights from a receptor model. Bioorg Med Chem Lett 25:229-35 (2014)  
Target
Name:
C-C chemokine receptor type 3
Synonyms:
C-C CKR-3 CC-CKR-3 CCR3 CD_antigen=CD193 CMKBR3 | Eosinophil eotaxin receptor
Type:
Enzyme
Mol. Mass.:
41053.88
Organism:
Homo sapiens (Human)
Description:
P51677
Residue:
355
  
Inhibitor
Name:
BDBM50041092
Synonyms:
CHEMBL3355966
Type:
Small organic molecule
Emp. Form.:
C35H40Cl2FN5O3
Mol. Mass.:
668.628
SMILES:
CCNC(=O)N[C@@H](CCN1CCC(CC1)c1c(CC)n(-c2ccc(cn2)C(=O)OC)c2cc(F)ccc12)Cc1ccc(Cl)c(Cl)c1
: