Target
cAMP-specific 3',5'-cyclic phosphodiesterase 4B
Ligand
BDBM50042036
Substrate
Meas. Tech.
ChEMBL_1443875 (CHEMBL3374136)
IC50
280±n/a nM
Citation
 Endo, YKawai, KAsano, TAmano, SAsanuma, YSawada, KOgura, KNagata, NUeo, NTakahashi, NSonoda, YKamei, N Discovery and SAR study of 2-(4-pyridylamino)thieno[3,2-d]pyrimidin-4(3H)-ones as soluble and highly potent PDE7 inhibitors. Bioorg Med Chem Lett 25:649-53 (2015)  
Target
Name:
cAMP-specific 3',5'-cyclic phosphodiesterase 4B
Synonyms:
3',5'-cyclic phosphodiesterase Isoform PDE4B1 PDE4B PDE4B_HUMAN Phosphodiesterase 4B (PDE4B) Phosphodiesterase Type 4 (PDE4B)
Type:
Protein
Mol. Mass.:
83318.87
Organism:
Homo sapiens (Human)
Description:
Q07343
Residue:
736
  
Inhibitor
Name:
BDBM50042036
Synonyms:
CHEMBL3360170
Type:
Small organic molecule
Emp. Form.:
C20H22FN5O3S
Mol. Mass.:
431.484
SMILES:
CCn1c(Nc2ccncc2F)nc2c(csc2c1=O)C1CCCN(C1)C(=O)OC
: