Target
Muscarinic acetylcholine receptor M5
Ligand
BDBM50042442
Substrate
Meas. Tech.
ChEMBL_1444284 (CHEMBL3380867)
IC50
963±n/a nM
Citation
 Kurata, HGentry, PRKokubo, MCho, HPBridges, TMNiswender, CMByers, FWWood, MRDaniels, JSConn, PJLindsley, CW Further optimization of the M5 NAM MLPCN probe ML375: tactics and challenges. Bioorg Med Chem Lett 25:690-4 (2015)  
Target
Name:
Muscarinic acetylcholine receptor M5
Synonyms:
ACM5_RAT Chrm-5 Muscarinic acetylcholine receptor | Muscarinic acetylcholine receptor M5
Type:
Enzyme Catalytic Domain
Mol. Mass.:
60161.80
Organism:
RAT
Description:
Cholinergic, muscarinic M5 CHRM5 RAT::P08911
Residue:
531
  
Inhibitor
Name:
BDBM50042442
Synonyms:
CHEMBL3353277
Type:
Small organic molecule
Emp. Form.:
C25H19F3N2O3
Mol. Mass.:
452.4252
SMILES:
COc1ccc(cc1C)C12N(CCN1C(=O)c1ccccc21)C(=O)c1cc(F)c(F)c(F)c1
: