Target
Dual specificity protein kinase TTK
Ligand
BDBM50042930
Substrate
Meas. Tech.
ChEMBL_1444682 (CHEMBL3377244)
IC50
0.700000±n/a nM
Citation
 Rosse, G Combination of novel imidazopyridazine mps-1 kinase inhibitors and bcl-2 family protein inhibitors. ACS Med Chem Lett 6:7-8 (2015)  
Target
Name:
Dual specificity protein kinase TTK
Synonyms:
Dual specificity protein kinase (TTK) MPS1 Monopolar Spindle 1 (MPS1) Monopolar Spindle 1 Kinase (MPS1) TTK | TTK_HUMAN
Type:
Protein
Mol. Mass.:
97086.79
Organism:
Homo sapiens (Human)
Description:
P33981
Residue:
857
  
Inhibitor
Name:
BDBM50042930
Synonyms:
CHEMBL3354569 | US9512126, 6
Type:
Small organic molecule
Emp. Form.:
C27H23F6N5O
Mol. Mass.:
547.4948
SMILES:
Cc1cc(ccc1C(=O)NC1CC1)-c1cnc2c(NCCC(F)(F)F)cc(nn12)C(F)(F)c1cccc(F)c1
: