Target
Serine-protein kinase ATM
Ligand
BDBM50043386
Substrate
Meas. Tech.
ChEMBL_1444859 (CHEMBL3379629)
IC50
14000±n/a nM
Citation
 Barsanti, PAAversa, RJJin, XPan, YLu, YElling, RJain, RKnapp, MLan, JLin, XRudewicz, PSim, JTaricani, LThomas, GXiao, LYue, Q Structure-Based Drug Design of Novel Potent and Selective Tetrahydropyrazolo[1,5-a]pyrazines as ATR Inhibitors. ACS Med Chem Lett 6:37-41 (2015)  
Target
Name:
Serine-protein kinase ATM
Synonyms:
A-T mutated ATM_HUMAN | Ataxia telangiectasia mutated
Type:
Protein
Mol. Mass.:
350696.72
Organism:
Homo sapiens (Human)
Description:
Q13315
Residue:
3056
  
Inhibitor
Name:
BDBM50043386
Synonyms:
CHEMBL3355073
Type:
Small organic molecule
Emp. Form.:
C20H26N6O2S
Mol. Mass.:
414.524
SMILES:
C[C@@H]1Cn2ncc(C3CCN(CC3)S(C)(=O)=O)c2CN1c1ccnc2[nH]ccc12
: