Target
Serine/threonine-protein kinase Chk1
Ligand
BDBM50043386
Substrate
Meas. Tech.
ChEMBL_1444862 (CHEMBL3379632)
IC50
160±n/a nM
Citation
 Barsanti, PAAversa, RJJin, XPan, YLu, YElling, RJain, RKnapp, MLan, JLin, XRudewicz, PSim, JTaricani, LThomas, GXiao, LYue, Q Structure-Based Drug Design of Novel Potent and Selective Tetrahydropyrazolo[1,5-a]pyrazines as ATR Inhibitors. ACS Med Chem Lett 6:37-41 (2015)  
Target
Name:
Serine/threonine-protein kinase Chk1
Synonyms:
CHEK1 CHK1 checkpoint homolog Checkpoint kinase-1 (CHK1)
Type:
Enzyme Catalytic Domain
Mol. Mass.:
54443.02
Organism:
Homo sapiens (Human)
Description:
gi_166295192
Residue:
476
  
Inhibitor
Name:
BDBM50043386
Synonyms:
CHEMBL3355073
Type:
Small organic molecule
Emp. Form.:
C20H26N6O2S
Mol. Mass.:
414.524
SMILES:
C[C@@H]1Cn2ncc(C3CCN(CC3)S(C)(=O)=O)c2CN1c1ccnc2[nH]ccc12
: