Target
Potassium voltage-gated channel subfamily H member 2
Ligand
BDBM50043386
Substrate
Meas. Tech.
ChEMBL_1444863 (CHEMBL3379633)
IC50
>30000±n/a nM
Citation
 Barsanti, PAAversa, RJJin, XPan, YLu, YElling, RJain, RKnapp, MLan, JLin, XRudewicz, PSim, JTaricani, LThomas, GXiao, LYue, Q Structure-Based Drug Design of Novel Potent and Selective Tetrahydropyrazolo[1,5-a]pyrazines as ATR Inhibitors. ACS Med Chem Lett 6:37-41 (2015)  
Target
Name:
Potassium voltage-gated channel subfamily H member 2
Synonyms:
1,3-beta-glucan synthase component GLS2 ERG Eag-related protein 1 Ether-a-go-go-related gene (HERG) Ether-a-go-go-related gene potassium channel 1 Ether-a-go-go-related gene potassium channel 1 (hERG1) Ether-a-go-go-related protein 1 H-ERG KCNH2 Potassium voltage-gated channel subfamily H member 2 (hERG) Voltage-gated potassium channel subunit Kv11.1 hERG Potassium Channel 1 | putative potassium channel subunit
Type:
Multi-pass membrane protein
Mol. Mass.:
126672.65
Organism:
Homo sapiens (Human)
Description:
Q12809
Residue:
1159
  
Inhibitor
Name:
BDBM50043386
Synonyms:
CHEMBL3355073
Type:
Small organic molecule
Emp. Form.:
C20H26N6O2S
Mol. Mass.:
414.524
SMILES:
C[C@@H]1Cn2ncc(C3CCN(CC3)S(C)(=O)=O)c2CN1c1ccnc2[nH]ccc12
: