Target
Serine/threonine-protein kinase Sgk2
Ligand
BDBM50443636
Substrate
Meas. Tech.
ChEMBL_1445193 (CHEMBL3375445)
IC50
924±n/a nM
Citation
 Halland, NSchmidt, FWeiss, TSaas, JLi, ZCzech, JDreyer, MHofmeister, AMertsch, KDietz, UStrübing, CNazare, M Discovery of N-[4-(1H-Pyrazolo[3,4-b]pyrazin-6-yl)-phenyl]-sulfonamides as Highly Active and Selective SGK1 Inhibitors. ACS Med Chem Lett 6:73-8 (2015)  
Target
Name:
Serine/threonine-protein kinase Sgk2
Synonyms:
SGK2 | SGK2_HUMAN
Type:
PROTEIN
Mol. Mass.:
47609.83
Organism:
Homo sapiens (Human)
Description:
ChEMBL_1445193
Residue:
427
  
Inhibitor
Name:
BDBM50443636
Synonyms:
CHEMBL3092460 US9221828, 1
Type:
Small organic molecule
Emp. Form.:
C17H12Cl2N6O2S
Mol. Mass.:
435.287
SMILES:
Nc1n[nH]c2nc(cnc12)-c1ccc(NS(=O)(=O)c2cccc(Cl)c2Cl)cc1
: