Target
Vascular endothelial growth factor receptor 2
Ligand
BDBM50331094
Substrate
Meas. Tech.
ChEMBL_1445347 (CHEMBL3378499)
Kd
2.1±n/a nM
Citation
 Okamoto, KIkemori-Kawada, MJestel, Avon König, KFunahashi, YMatsushima, TTsuruoka, AInoue, AMatsui, J Distinct binding mode of multikinase inhibitor lenvatinib revealed by biochemical characterization. ACS Med Chem Lett 6:89-94 (2015)  
Target
Name:
Vascular endothelial growth factor receptor 2
Synonyms:
CD_antigen=CD309 Fetal liver kinase 1 (FLK-1) KDR Protein-tyrosine kinase receptor Flk-1 VEGFR-2 VEGFR2 Vascular Endothelial Growth Factor Receptor Kinase 2 Vascular endothelial growth factor receptor 2 (KDR) Vascular endothelial growth factor receptor 2 (VEGFR2) Vascular endothelial growth factor receptor-2 (VEGFR-2)
Type:
Receptor Tyrosine Kinase
Mol. Mass.:
151510.97
Organism:
Homo sapiens (Human)
Description:
P35968
Residue:
1356
  
Inhibitor
Name:
BDBM50331094
Synonyms:
4-(3-chloro-4-(3-cyclopropylureido)phenoxy)-7-methoxyquinoline-6-carboxamide CHEMBL1289601 Lenvatinib mesilate lenvatinib
Type:
Small organic molecule
Emp. Form.:
C21H19ClN4O4
Mol. Mass.:
426.853
SMILES:
COc1cc2nccc(Oc3ccc(NC(=O)NC4CC4)c(Cl)c3)c2cc1C(N)=O
: