Target
Transient receptor potential cation channel subfamily A member 1
Ligand
BDBM50396009
Substrate
Meas. Tech.
ChEMBL_1452553 (CHEMBL3363420)
EC50
9000±n/a nM
Citation
 Terada, YKitajima, MTaguchi, FTakayama, HHorie, SWatanabe, T Identification of Indole Alkaloid Structural Units Important for Stimulus-Selective TRPM8 Inhibition: SAR Study of Naturally Occurring Iboga Derivatives. J Nat Prod 77:1831-8 (2014)  
Target
Name:
Transient receptor potential cation channel subfamily A member 1
Synonyms:
ANKTM1 TRPA1 Transformation-sensitive protein p120 | Transient receptor potential cation channel subfamily A member 1 (TRPA1)
Type:
Protein
Mol. Mass.:
127514.20
Organism:
Homo sapiens (Human)
Description:
O75762
Residue:
1119
  
Inhibitor
Name:
BDBM50396009
Synonyms:
CHEMBL2163793
Type:
Small organic molecule
Emp. Form.:
C21H24N2O2
Mol. Mass.:
336.4275
SMILES:
CCC1=C[C@@H]2CN3CCc4c([nH]c5ccccc45)[C@@](C2)([C@@H]13)C(=O)OC
: