Target
Transient receptor potential cation channel subfamily V member 1
Ligand
BDBM50044111
Substrate
Meas. Tech.
ChEMBL_1452551 (CHEMBL3363142)
EC50
26000±n/a nM
Citation
 Terada, YKitajima, MTaguchi, FTakayama, HHorie, SWatanabe, T Identification of Indole Alkaloid Structural Units Important for Stimulus-Selective TRPM8 Inhibition: SAR Study of Naturally Occurring Iboga Derivatives. J Nat Prod 77:1831-8 (2014)  
Target
Name:
Transient receptor potential cation channel subfamily V member 1
Synonyms:
Capsaicin receptor Osm-9-like TRP channel 1 TRPV1_HUMAN Transient receptor potential cation channel subfamily V member 1 (TRPV1) Transient receptor potential cation channel subfamily V member 1(TRPV1) Vanilloid VR1 Vanilloid receptor 1 Vanilloid receptor 1 (VRI/TRPV1)
Type:
Protein
Mol. Mass.:
94960.75
Organism:
Homo sapiens (Human)
Description:
Q8NER1
Residue:
839
  
Inhibitor
Name:
BDBM50044111
Synonyms:
CHEBI:2625 | CHEMBL3325767
Type:
Small organic molecule
Emp. Form.:
C43H48N4O6
Mol. Mass.:
716.8644
SMILES:
[H][C@]12CCN3CC[C@@]45c6cccc(OC)c6N6C[C@@]78C[C@]([H])(C[C@@]1(CCO2)[C@]34[H])[C@@]56O[C@@]7([H])N1CC[C@@]23C(Nc4ccccc24)=C(C[C@@]2(CCO[C@@]82[H])[C@]13[H])C(=O)OC
: