Target
Bifunctional 3'-5' exonuclease/ATP-dependent helicase WRN
Ligand
BDBM50044626
Substrate
Meas. Tech.
ChEMBL_1446572 (CHEMBL3377971)
IC50
20000±n/a nM
Citation
 Huang, FMazin, AV Targeting the homologous recombination pathway by small molecule modulators. Bioorg Med Chem Lett 24:3006-13 (2014)  
Target
Name:
Bifunctional 3'-5' exonuclease/ATP-dependent helicase WRN
Synonyms:
DNA helicase, RecQ-like type 3 RECQ3 RecQ protein-like 2 WRN_HUMAN | Werner syndrome ATP-dependent helicase
Type:
PROTEIN
Mol. Mass.:
162454.09
Organism:
Homo sapiens (Human)
Description:
ChEMBL_105140
Residue:
1432
  
Inhibitor
Name:
BDBM50044626
Synonyms:
CHEMBL1374426
Type:
Small organic molecule
Emp. Form.:
C8H9NO4
Mol. Mass.:
183.1614
SMILES:
CCC(=O)OCN1C(=O)C=CC1=O
: