Target
Adenosine receptor A2a
Ligand
BDBM50445614
Substrate
Meas. Tech.
ChEMBL_1449192 (CHEMBL3379866)
Ki
>10000±n/a nM
Citation
 Rajagopalan, PTracey, HChen, ZBandyopadhyaya, AVeeraraghavan, SRajagopalan, DRSalvemini, DMcPhee, IViswanadha, SRajagopalan, R DDD-028: a potent potential non-opioid, non-cannabinoid analgesic for neuropathic and inflammatory pain. Bioorg Med Chem Lett 24:3088-91 (2014)  
Target
Name:
Adenosine receptor A2a
Synonyms:
A2A adenosine receptor (hA2A) ADENOSINE A2 ADORA2 Adenosine A2A receptor (A2AAR)
Type:
G Protein-Coupled Receptor (GPCR)
Mol. Mass.:
44716.46
Organism:
Homo sapiens (Human)
Description:
P29274
Residue:
412
  
Inhibitor
Name:
BDBM50445614
Synonyms:
CHEMBL3104093
Type:
Small organic molecule
Emp. Form.:
C20H20N2
Mol. Mass.:
288.3862
SMILES:
CN1CCc2c(C1)c1cccc3-c4ccccc4CCn2c13
: