Target
Alpha-2A adrenergic receptor
Ligand
BDBM50445614
Substrate
Meas. Tech.
ChEMBL_1450021 (CHEMBL3373283)
Ki
407±n/a nM
Citation
 Rajagopalan, PTracey, HChen, ZBandyopadhyaya, AVeeraraghavan, SRajagopalan, DRSalvemini, DMcPhee, IViswanadha, SRajagopalan, R DDD-028: a potent potential non-opioid, non-cannabinoid analgesic for neuropathic and inflammatory pain. Bioorg Med Chem Lett 24:3088-91 (2014)  
Target
Name:
Alpha-2A adrenergic receptor
Synonyms:
ADA2A_HUMAN ADRA2R Adrenergic alpha2A Alpha-2 adrenergic receptor subtype C10 Alpha-2A adrenoreceptor alpha-2A adrenergic receptor [Homo sapiens]
Type:
Enzyme
Mol. Mass.:
48979.91
Organism:
Homo sapiens (Human)
Description:
P08913
Residue:
465
  
Inhibitor
Name:
BDBM50445614
Synonyms:
CHEMBL3104093
Type:
Small organic molecule
Emp. Form.:
C20H20N2
Mol. Mass.:
288.3862
SMILES:
CN1CCc2c(C1)c1cccc3-c4ccccc4CCn2c13
: