Target
5-hydroxytryptamine receptor 7
Ligand
BDBM50445614
Substrate
Meas. Tech.
ChEMBL_1450029 (CHEMBL3373291)
Ki
195±n/a nM
Citation
 Rajagopalan, PTracey, HChen, ZBandyopadhyaya, AVeeraraghavan, SRajagopalan, DRSalvemini, DMcPhee, IViswanadha, SRajagopalan, R DDD-028: a potent potential non-opioid, non-cannabinoid analgesic for neuropathic and inflammatory pain. Bioorg Med Chem Lett 24:3088-91 (2014)  
Target
Name:
5-hydroxytryptamine receptor 7
Synonyms:
5-HT-7 5-HT7 5-HT7S 5HT7 HTR7 | Serotonin receptor 7
Type:
G Protein-Coupled Receptor (GPCR)
Mol. Mass.:
53573.08
Organism:
Homo sapiens (Human)
Description:
P34969
Residue:
479
  
Inhibitor
Name:
BDBM50445614
Synonyms:
CHEMBL3104093
Type:
Small organic molecule
Emp. Form.:
C20H20N2
Mol. Mass.:
288.3862
SMILES:
CN1CCc2c(C1)c1cccc3-c4ccccc4CCn2c13
: