Target
Vasopressin V1a receptor
Ligand
BDBM50044779
Substrate
Meas. Tech.
ChEMBL_1451728 (CHEMBL3366921)
EC50
>100±n/a nM
Citation
 Wisniewski, KAlagarsamy, SGalyean, RTariga, HThompson, DLy, BWisniewska, HQi, SCroston, GLaporte, RRivière, PJSchteingart, CD New, potent, and selective peptidic oxytocin receptor agonists. J Med Chem 57:5306-17 (2014)  
Target
Name:
Vasopressin V1a receptor
Synonyms:
AVPR V1a AVPR1A V1AR_HUMAN VASOPRESSIN V1A Vasopressin V1 receptor Vasopressin receptor
Type:
Receptor
Mol. Mass.:
46820.18
Organism:
Homo sapiens (Human)
Description:
P37288
Residue:
418
  
Inhibitor
Name:
BDBM50044779
Synonyms:
CHEMBL3353936
Type:
Small organic molecule
Emp. Form.:
C47H73N11O13S
Mol. Mass.:
1032.213
SMILES:
[H][C@]1(NC(=O)[C@H](Cc2ccc(OCC)cc2)NC(=O)CCCSC[C@H](NC(=O)[C@H](CC(N)=O)NC(=O)[C@H](CCC(N)=O)NC1=O)C(=O)N1C[C@H](C[C@H]1C(=O)N[C@@H](CC(C)C)C(=O)NCC(N)=O)OC)[C@@H](C)CC
: