Target
Vasopressin V1b receptor
Ligand
BDBM50044781
Substrate
Meas. Tech.
ChEMBL_1451729 (CHEMBL3366922)
EC50
>10000±n/a nM
Citation
 Wisniewski, KAlagarsamy, SGalyean, RTariga, HThompson, DLy, BWisniewska, HQi, SCroston, GLaporte, RRivière, PJSchteingart, CD New, potent, and selective peptidic oxytocin receptor agonists. J Med Chem 57:5306-17 (2014)  
Target
Name:
Vasopressin V1b receptor
Synonyms:
AVPR V1b AVPR1B Antidiuretic hormone receptor 1b V1bR VPR3 Vasopressin V1b receptor (V1b) Vasopressin V3 receptor
Type:
Enzyme
Mol. Mass.:
46985.01
Organism:
Homo sapiens (Human)
Description:
P47901
Residue:
424
  
Inhibitor
Name:
BDBM50044781
Synonyms:
CHEMBL3353934
Type:
Small organic molecule
Emp. Form.:
C46H71N11O12S2
Mol. Mass.:
1034.252
SMILES:
[H][C@]1(NC(=O)[C@H](Cc2ccc(OC)cc2)NC(=O)CCCSC[C@H](NC(=O)[C@H](CC(N)=O)NC(=O)[C@H](CCC(N)=O)NC1=O)C(=O)N1C[C@@H](C[C@H]1C(=O)N[C@@H](CC(C)C)C(=O)NCC(N)=O)SC)[C@@H](C)CC
: