Target
Galectin-3
Ligand
BDBM50045334
Substrate
Meas. Tech.
ChEMBL_1458974 (CHEMBL3369567)
Kd
18200±n/a nM
Citation
 Gibbs, AC Elements and modulation of functional dynamics. J Med Chem 57:7819-37 (2014)  
Target
Name:
Galectin-3
Synonyms:
LEG3_HUMAN MAC2
Type:
Enzyme
Mol. Mass.:
26156.54
Organism:
Homo sapiens (Human)
Description:
P17931
Residue:
250
  
Inhibitor
Name:
BDBM50045334
Synonyms:
CHEMBL3337492
Type:
Small organic molecule
Emp. Form.:
C21H30N2O11
Mol. Mass.:
486.4697
SMILES:
[H][C@@]1(O[C@@H]2O[C@H](CO)[C@H](O)[C@H](NC(=O)c3ccccc3)[C@H]2O)[C@@H](CO)OC(O)[C@H](NC(C)=O)[C@H]1O
: