Target
Galectin-3
Ligand
BDBM50045335
Substrate
Meas. Tech.
ChEMBL_1458974 (CHEMBL3369567)
Kd
3300±n/a nM
Citation
 Gibbs, AC Elements and modulation of functional dynamics. J Med Chem 57:7819-37 (2014)  
Target
Name:
Galectin-3
Synonyms:
LEG3_HUMAN MAC2
Type:
Enzyme
Mol. Mass.:
26156.54
Organism:
Homo sapiens (Human)
Description:
P17931
Residue:
250
  
Inhibitor
Name:
BDBM50045335
Synonyms:
CHEMBL3337493
Type:
Small organic molecule
Emp. Form.:
C22H28F4N2O12
Mol. Mass.:
588.4575
SMILES:
[H][C@]1(O[C@@H]2O[C@H](CO)[C@H](O)[C@H](NC(=O)c3c(F)c(F)c(OC)c(F)c3F)[C@H]2O)[C@H](O)[C@@H](NC(C)=O)C(O)O[C@@H]1CO
: