Target
Cathepsin B
Ligand
BDBM50338854
Substrate
Meas. Tech.
ChEMBL_1459865 (CHEMBL3367288)
Ki
40000±n/a nM
Citation
 Raghav, NSingh, M SAR studies of differently functionalized chalcones based hydrazones and their cyclized derivatives as inhibitors of mammalian cathepsin B and cathepsin H. Bioorg Med Chem 22:4233-45 (2014)  
Target
Name:
Cathepsin B
Synonyms:
Type:
Protein
Mol. Mass.:
36777.57
Organism:
Capra hircus (Goat)
Description:
Residue:
335
  
Inhibitor
Name:
BDBM50338854
Synonyms:
3,5-diphenyl-4,5-dihydro-1H-pyrazole | CHEMBL1684781
Type:
Small organic molecule
Emp. Form.:
C15H14N2
Mol. Mass.:
222.2851
SMILES:
C1C(N=NC1c1ccccc1)c1ccccc1
: