Target
Casein kinase I isoform delta
Ligand
BDBM50044784
Substrate
Meas. Tech.
ChEMBL_1453623 (CHEMBL3363472)
IC50
188±n/a nM
Citation
 Seerden, JPLeusink-Ionescu, GWoudenberg-Vrenken, TDros, BMolema, GKamps, JAKellogg, RM Synthesis and structure-activity relationships of 4-fluorophenyl-imidazole p38a MAPK, CK1d and JAK2 kinase inhibitors. Bioorg Med Chem Lett 24:3412-8 (2014)  
Target
Name:
Casein kinase I isoform delta
Synonyms:
CKI-delta CSNK1D Casein kinase I delta Casein kinase I isoform delta (CK1D) KC1D_HUMAN | casein kinases 1 delta (CK1 delta)
Type:
Enzyme
Mol. Mass.:
47356.76
Organism:
Homo sapiens (Human)
Description:
P48730
Residue:
415
  
Inhibitor
Name:
BDBM50044784
Synonyms:
CHEBI:79090 US10865384, Compound SB202190
Type:
Small organic molecule
Emp. Form.:
C20H14FN3O
Mol. Mass.:
331.3431
SMILES:
Oc1ccc(cc1)-c1nc(c([nH]1)-c1ccncc1)-c1ccc(F)cc1
: