Target
Casein kinase I isoform delta
Ligand
BDBM50045578
Substrate
Meas. Tech.
ChEMBL_1453623 (CHEMBL3363472)
IC50
3100±n/a nM
Citation
 Seerden, JPLeusink-Ionescu, GWoudenberg-Vrenken, TDros, BMolema, GKamps, JAKellogg, RM Synthesis and structure-activity relationships of 4-fluorophenyl-imidazole p38a MAPK, CK1d and JAK2 kinase inhibitors. Bioorg Med Chem Lett 24:3412-8 (2014)  
Target
Name:
Casein kinase I isoform delta
Synonyms:
CKI-delta CSNK1D Casein kinase I delta Casein kinase I isoform delta (CK1D) KC1D_HUMAN | casein kinases 1 delta (CK1 delta)
Type:
Enzyme
Mol. Mass.:
47356.76
Organism:
Homo sapiens (Human)
Description:
P48730
Residue:
415
  
Inhibitor
Name:
BDBM50045578
Synonyms:
CHEMBL3120969
Type:
Small organic molecule
Emp. Form.:
C23H26FN6O3P
Mol. Mass.:
484.4631
SMILES:
CCOP(=O)(CCn1cc(nn1)-c1nc(c(-c2ccncc2)n1C)-c1ccc(F)cc1)OCC
: