Target
Casein kinase I isoform delta
Ligand
BDBM50045570
Substrate
Meas. Tech.
ChEMBL_1453623 (CHEMBL3363472)
IC50
5960±n/a nM
Citation
 Seerden, JPLeusink-Ionescu, GWoudenberg-Vrenken, TDros, BMolema, GKamps, JAKellogg, RM Synthesis and structure-activity relationships of 4-fluorophenyl-imidazole p38a MAPK, CK1d and JAK2 kinase inhibitors. Bioorg Med Chem Lett 24:3412-8 (2014)  
Target
Name:
Casein kinase I isoform delta
Synonyms:
CKI-delta CSNK1D Casein kinase I delta Casein kinase I isoform delta (CK1D) KC1D_HUMAN | casein kinases 1 delta (CK1 delta)
Type:
Enzyme
Mol. Mass.:
47356.76
Organism:
Homo sapiens (Human)
Description:
P48730
Residue:
415
  
Inhibitor
Name:
BDBM50045570
Synonyms:
CHEMBL3314285
Type:
Small organic molecule
Emp. Form.:
C20H15FN4OS
Mol. Mass.:
378.423
SMILES:
CSc1nccc(n1)-c1[nH]c(nc1-c1ccc(F)cc1)-c1ccc(O)cc1
: