Target
Tyrosine-protein kinase JAK1
Ligand
BDBM50045560
Substrate
Meas. Tech.
ChEMBL_1453624 (CHEMBL3363473)
IC50
>10000±n/a nM
Citation
 Seerden, JPLeusink-Ionescu, GWoudenberg-Vrenken, TDros, BMolema, GKamps, JAKellogg, RM Synthesis and structure-activity relationships of 4-fluorophenyl-imidazole p38a MAPK, CK1d and JAK2 kinase inhibitors. Bioorg Med Chem Lett 24:3412-8 (2014)  
Target
Name:
Tyrosine-protein kinase JAK1
Synonyms:
JAK-1 JAK1A JAK1_HUMAN Janus kinase 1 (JAK1) | Janus kinase 1 JAK1
Type:
Protein
Mol. Mass.:
133293.73
Organism:
Homo sapiens (Human)
Description:
P23458
Residue:
1154
  
Inhibitor
Name:
BDBM50045560
Synonyms:
CHEMBL3314276
Type:
Small organic molecule
Emp. Form.:
C22H14FN3O
Mol. Mass.:
355.3645
SMILES:
Fc1ccc(cc1)-c1nc([nH]c1-c1cc[nH]c(=O)c1)-c1ccc(cc1)C#C
: