Target
Tyrosine-protein kinase JAK2
Ligand
BDBM50045565
Substrate
Meas. Tech.
ChEMBL_1453625 (CHEMBL3363474)
IC50
911±n/a nM
Citation
 Seerden, JPLeusink-Ionescu, GWoudenberg-Vrenken, TDros, BMolema, GKamps, JAKellogg, RM Synthesis and structure-activity relationships of 4-fluorophenyl-imidazole p38a MAPK, CK1d and JAK2 kinase inhibitors. Bioorg Med Chem Lett 24:3412-8 (2014)  
Target
Name:
Tyrosine-protein kinase JAK2
Synonyms:
JAK-2 JAK2_HUMAN Janus kinase 2 (JAK2) | Janus kinase 2 (a protein tyrosine kinase)
Type:
Protein
Mol. Mass.:
130684.68
Organism:
Homo sapiens (Human)
Description:
O60674
Residue:
1132
  
Inhibitor
Name:
BDBM50045565
Synonyms:
CHEMBL3314281
Type:
Small organic molecule
Emp. Form.:
C20H14FN3O2
Mol. Mass.:
347.3425
SMILES:
Oc1ccc(cc1)-c1nc(c([nH]1)-c1cc[nH]c(=O)c1)-c1ccc(F)cc1
: