Target
Mitogen-activated protein kinase 14
Ligand
BDBM50045573
Substrate
Meas. Tech.
ChEMBL_1453622 (CHEMBL3363471)
IC50
166±n/a nM
Citation
 Seerden, JPLeusink-Ionescu, GWoudenberg-Vrenken, TDros, BMolema, GKamps, JAKellogg, RM Synthesis and structure-activity relationships of 4-fluorophenyl-imidazole p38a MAPK, CK1d and JAK2 kinase inhibitors. Bioorg Med Chem Lett 24:3412-8 (2014)  
Target
Name:
Mitogen-activated protein kinase 14
Synonyms:
CSAID-binding protein CSBP1 CSPB1 MAP kinase 14 MAP kinase p38 alpha MAPK14 MK14_HUMAN Mitogen-activated protein kinase p38 alpha Stress-activated protein kinase 2a | p38 MAP kinase alpha/beta
Type:
Serine/threonine-protein kinase
Mol. Mass.:
41286.76
Organism:
Homo sapiens (Human)
Description:
Q16539
Residue:
360
  
Inhibitor
Name:
BDBM50045573
Synonyms:
CHEMBL3120995
Type:
Small organic molecule
Emp. Form.:
C24H17FN6O2
Mol. Mass.:
440.4292
SMILES:
Cn1c(nc(c1-c1ccncc1)-c1ccc(F)cc1)-c1cn(nn1)-c1ccc(cc1)C(O)=O
: