Target
Carbonic anhydrase 12
Ligand
BDBM46912
Substrate
Meas. Tech.
ChEMBL_1447570 (CHEMBL3373765)
IC50
226±n/a nM
Citation
 Rosatelli, ECarotti, ACeruso, MSupuran, CTGioiello, A Flow synthesis and biological activity of aryl sulfonamides as selective carbonic anhydrase IX and XII inhibitors. Bioorg Med Chem Lett 24:3422-5 (2014)  
Target
Name:
Carbonic anhydrase 12
Synonyms:
CA-XII CAH12_HUMAN Carbonic anhydrase Carbonic anhydrase XII Carbonic anhydrase XII (CAXII) | Tumor antigen HOM-RCC-3.1.3
Type:
Enzyme
Mol. Mass.:
39456.00
Organism:
Homo sapiens (Human)
Description:
Catalytic domain of human cloned isozyme was used in the assay
Residue:
354
  
Inhibitor
Name:
BDBM46912
Synonyms:
4-methyl-N-(2-phenylphenyl)benzenesulfonamide N-2-biphenylyl-4-methylbenzenesulfonamide cid_818647
Type:
Small organic molecule
Emp. Form.:
C19H17NO2S
Mol. Mass.:
323.409
SMILES:
Cc1ccc(cc1)S(=O)(=O)Nc1ccccc1-c1ccccc1
: