Target
Carbonic anhydrase 12
Ligand
BDBM50046166
Substrate
Meas. Tech.
ChEMBL_1447570 (CHEMBL3373765)
IC50
248±n/a nM
Citation
 Rosatelli, ECarotti, ACeruso, MSupuran, CTGioiello, A Flow synthesis and biological activity of aryl sulfonamides as selective carbonic anhydrase IX and XII inhibitors. Bioorg Med Chem Lett 24:3422-5 (2014)  
Target
Name:
Carbonic anhydrase 12
Synonyms:
CA-XII CAH12_HUMAN Carbonic anhydrase Carbonic anhydrase XII Carbonic anhydrase XII (CAXII) | Tumor antigen HOM-RCC-3.1.3
Type:
Enzyme
Mol. Mass.:
39456.00
Organism:
Homo sapiens (Human)
Description:
Catalytic domain of human cloned isozyme was used in the assay
Residue:
354
  
Inhibitor
Name:
BDBM50046166
Synonyms:
CHEMBL3310984
Type:
Small organic molecule
Emp. Form.:
C12H19NO2S
Mol. Mass.:
241.35
SMILES:
CCCC(C)NS(=O)(=O)c1ccc(C)cc1
: