Target
Toxin ParE
Ligand
BDBM50358854
Substrate
Meas. Tech.
ChEMBL_1454591 (CHEMBL3366703)
IC50
160±n/a nM
Citation
 Basarab, GSHill, PJGarner, CEHull, KGreen, OSherer, BADangel, PBManchester, JIBist, SHauck, SZhou, FUria-Nickelsen, MIllingworth, RAlm, RRooney, MEakin, AE Optimization of pyrrolamide topoisomerase II inhibitors toward identification of an antibacterial clinical candidate (AZD5099). J Med Chem 57:6060-82 (2014)  
Target
Name:
Toxin ParE
Synonyms:
Gyrase inhibitor ParE Toxin ParE | parE
Type:
PROTEIN
Mol. Mass.:
11720.14
Organism:
Escherichia coli
Description:
ChEMBL_109450
Residue:
103
  
Inhibitor
Name:
BDBM50358854
Synonyms:
CHEMBL1923440
Type:
Small organic molecule
Emp. Form.:
C15H15Cl2FN4O3S
Mol. Mass.:
421.274
SMILES:
Cc1[nH]c(C(=O)N[C@@H]2CCN(C[C@@H]2F)c2ncc(s2)C(O)=O)c(Cl)c1Cl
: