Target
Toxin ParE
Ligand
BDBM50047336
Substrate
Meas. Tech.
ChEMBL_1454591 (CHEMBL3366703)
IC50
51±n/a nM
Citation
 Basarab, GSHill, PJGarner, CEHull, KGreen, OSherer, BADangel, PBManchester, JIBist, SHauck, SZhou, FUria-Nickelsen, MIllingworth, RAlm, RRooney, MEakin, AE Optimization of pyrrolamide topoisomerase II inhibitors toward identification of an antibacterial clinical candidate (AZD5099). J Med Chem 57:6060-82 (2014)  
Target
Name:
Toxin ParE
Synonyms:
Gyrase inhibitor ParE Toxin ParE | parE
Type:
PROTEIN
Mol. Mass.:
11720.14
Organism:
Escherichia coli
Description:
ChEMBL_109450
Residue:
103
  
Inhibitor
Name:
BDBM50047336
Synonyms:
CHEMBL3314545
Type:
Small organic molecule
Emp. Form.:
C19H22Cl2N4O6S
Mol. Mass.:
505.372
SMILES:
CO[C@H]1CO[C@]2(CN(CC[C@H]2NC(=O)c2[nH]c(C)c(Cl)c2Cl)c2ncc(s2)C(O)=O)OC1
: