Target
Toxin ParE
Ligand
BDBM50046994
Substrate
Meas. Tech.
ChEMBL_1454591 (CHEMBL3366703)
IC50
41±n/a nM
Citation
 Basarab, GSHill, PJGarner, CEHull, KGreen, OSherer, BADangel, PBManchester, JIBist, SHauck, SZhou, FUria-Nickelsen, MIllingworth, RAlm, RRooney, MEakin, AE Optimization of pyrrolamide topoisomerase II inhibitors toward identification of an antibacterial clinical candidate (AZD5099). J Med Chem 57:6060-82 (2014)  
Target
Name:
Toxin ParE
Synonyms:
Gyrase inhibitor ParE Toxin ParE | parE
Type:
PROTEIN
Mol. Mass.:
11720.14
Organism:
Escherichia coli
Description:
ChEMBL_109450
Residue:
103
  
Inhibitor
Name:
BDBM50046994
Synonyms:
CHEMBL3314547
Type:
Small organic molecule
Emp. Form.:
C20H22Cl2N4O5S
Mol. Mass.:
501.383
SMILES:
Cc1[nH]c(C(=O)N[C@@H]2CCN(C[C@]22OCC3(CC3)CO2)c2ncc(s2)C(O)=O)c(Cl)c1Cl
: