Target
Toxin ParE
Ligand
BDBM50047221
Substrate
Meas. Tech.
ChEMBL_1454591 (CHEMBL3366703)
IC50
59±n/a nM
Citation
 Basarab, GSHill, PJGarner, CEHull, KGreen, OSherer, BADangel, PBManchester, JIBist, SHauck, SZhou, FUria-Nickelsen, MIllingworth, RAlm, RRooney, MEakin, AE Optimization of pyrrolamide topoisomerase II inhibitors toward identification of an antibacterial clinical candidate (AZD5099). J Med Chem 57:6060-82 (2014)  
Target
Name:
Toxin ParE
Synonyms:
Gyrase inhibitor ParE Toxin ParE | parE
Type:
PROTEIN
Mol. Mass.:
11720.14
Organism:
Escherichia coli
Description:
ChEMBL_109450
Residue:
103
  
Inhibitor
Name:
BDBM50047221
Synonyms:
CHEMBL3314573
Type:
Small organic molecule
Emp. Form.:
C23H30Cl2N6O6S
Mol. Mass.:
589.492
SMILES:
CO[C@H]1CN(CC[C@H]1NC(=O)c1[nH]c(C)c(Cl)c1Cl)c1nc(C(=O)NCCN2CCOCC2)c(s1)C(O)=O
: