Target
Toxin ParE
Ligand
BDBM50047339
Substrate
Meas. Tech.
ChEMBL_1454591 (CHEMBL3366703)
IC50
62±n/a nM
Citation
 Basarab, GSHill, PJGarner, CEHull, KGreen, OSherer, BADangel, PBManchester, JIBist, SHauck, SZhou, FUria-Nickelsen, MIllingworth, RAlm, RRooney, MEakin, AE Optimization of pyrrolamide topoisomerase II inhibitors toward identification of an antibacterial clinical candidate (AZD5099). J Med Chem 57:6060-82 (2014)  
Target
Name:
Toxin ParE
Synonyms:
Gyrase inhibitor ParE Toxin ParE | parE
Type:
PROTEIN
Mol. Mass.:
11720.14
Organism:
Escherichia coli
Description:
ChEMBL_109450
Residue:
103
  
Inhibitor
Name:
BDBM50047339
Synonyms:
CHEMBL3314583
Type:
Small organic molecule
Emp. Form.:
C20H22Cl2N6O4S
Mol. Mass.:
513.397
SMILES:
CO[C@H]1CN(CC[C@H]1NC(=O)c1[nH]c(C)c(Cl)c1Cl)c1nc(-c2cn(C)cn2)c(s1)C(O)=O
: