Target
Adenosine receptor A1
Ligand
BDBM50048031
Substrate
Meas. Tech.
ChEMBL_1452895 (CHEMBL3366211)
Ki
46±n/a nM
Citation
 Federico, SCiancetta, APorta, NRedenti, SPastorin, GCacciari, BKlotz, KNMoro, SSpalluto, G Scaffold decoration at positions 5 and 8 of 1,2,4-triazolo[1,5-c]pyrimidines to explore the antagonist profiling on adenosine receptors: a preliminary structure-activity relationship study. J Med Chem 57:6210-25 (2014)  
Target
Name:
Adenosine receptor A1
Synonyms:
A1 adenosine receptor (hA1) AA1R_HUMAN ADORA1 Adenosine A1-receptor Adenosine receptor A1 (hA1) | Adenosine transporter (AdT)
Type:
G Protein-Coupled Receptor (GPCR)
Mol. Mass.:
36520.92
Organism:
Homo sapiens (Human)
Description:
P30542
Residue:
326
  
Inhibitor
Name:
BDBM50048031
Synonyms:
CHEMBL3314913
Type:
Small organic molecule
Emp. Form.:
C16H19N5O3
Mol. Mass.:
329.3538
SMILES:
CCOC(=O)c1cnc(NCC(C)C)n2nc(nc12)-c1ccco1
: