Target
Adenosine receptor A2a
Ligand
BDBM50047982
Substrate
Meas. Tech.
ChEMBL_1452896 (CHEMBL3366212)
Ki
12±n/a nM
Citation
 Federico, SCiancetta, APorta, NRedenti, SPastorin, GCacciari, BKlotz, KNMoro, SSpalluto, G Scaffold decoration at positions 5 and 8 of 1,2,4-triazolo[1,5-c]pyrimidines to explore the antagonist profiling on adenosine receptors: a preliminary structure-activity relationship study. J Med Chem 57:6210-25 (2014)  
Target
Name:
Adenosine receptor A2a
Synonyms:
A2A adenosine receptor (hA2A) ADENOSINE A2 ADORA2 Adenosine A2A receptor (A2AAR)
Type:
G Protein-Coupled Receptor (GPCR)
Mol. Mass.:
44716.46
Organism:
Homo sapiens (Human)
Description:
P29274
Residue:
412
  
Inhibitor
Name:
BDBM50047982
Synonyms:
CHEMBL3314879
Type:
Small organic molecule
Emp. Form.:
C19H16N6O3
Mol. Mass.:
376.3687
SMILES:
CNC(=O)c1cnc(NC(=O)Cc2ccccc2)n2nc(nc12)-c1ccco1
: