Target
Adenosine receptor A2a
Ligand
BDBM50047985
Substrate
Meas. Tech.
ChEMBL_1452896 (CHEMBL3366212)
Ki
28±n/a nM
Citation
 Federico, SCiancetta, APorta, NRedenti, SPastorin, GCacciari, BKlotz, KNMoro, SSpalluto, G Scaffold decoration at positions 5 and 8 of 1,2,4-triazolo[1,5-c]pyrimidines to explore the antagonist profiling on adenosine receptors: a preliminary structure-activity relationship study. J Med Chem 57:6210-25 (2014)  
Target
Name:
Adenosine receptor A2a
Synonyms:
A2A adenosine receptor (hA2A) ADENOSINE A2 ADORA2 Adenosine A2A receptor (A2AAR)
Type:
G Protein-Coupled Receptor (GPCR)
Mol. Mass.:
44716.46
Organism:
Homo sapiens (Human)
Description:
P29274
Residue:
412
  
Inhibitor
Name:
BDBM50047985
Synonyms:
CHEMBL3314882
Type:
Small organic molecule
Emp. Form.:
C26H22N6O3
Mol. Mass.:
466.4913
SMILES:
O=C(Cc1ccccc1)Nc1ncc(C(=O)NCCc2ccccc2)c2nc(nn12)-c1ccco1
: