Target
Adenosine receptor A2a
Ligand
BDBM50048014
Substrate
Meas. Tech.
ChEMBL_1452896 (CHEMBL3366212)
Ki
39±n/a nM
Citation
 Federico, SCiancetta, APorta, NRedenti, SPastorin, GCacciari, BKlotz, KNMoro, SSpalluto, G Scaffold decoration at positions 5 and 8 of 1,2,4-triazolo[1,5-c]pyrimidines to explore the antagonist profiling on adenosine receptors: a preliminary structure-activity relationship study. J Med Chem 57:6210-25 (2014)  
Target
Name:
Adenosine receptor A2a
Synonyms:
A2A adenosine receptor (hA2A) ADENOSINE A2 ADORA2 Adenosine A2A receptor (A2AAR)
Type:
G Protein-Coupled Receptor (GPCR)
Mol. Mass.:
44716.46
Organism:
Homo sapiens (Human)
Description:
P29274
Residue:
412
  
Inhibitor
Name:
BDBM50048014
Synonyms:
CHEMBL3314898
Type:
Small organic molecule
Emp. Form.:
C19H16FN5O3
Mol. Mass.:
381.3604
SMILES:
CCOC(=O)c1cnc(NCc2ccc(F)cc2)n2nc(nc12)-c1ccco1
: