Target
Galectin-3
Ligand
BDBM50048091
Substrate
Meas. Tech.
ChEMBL_1454623 (CHEMBL3361812)
Kd
10000000±n/a nM
Citation
 Rajput, VKLeffler, HNilsson, UJMukhopadhyay, B Synthesis and evaluation of iminocoumaryl and coumaryl derivatized glycosides as galectin antagonists. Bioorg Med Chem Lett 24:3516-20 (2014)  
Target
Name:
Galectin-3
Synonyms:
LEG3_HUMAN MAC2
Type:
Enzyme
Mol. Mass.:
26156.54
Organism:
Homo sapiens (Human)
Description:
P17931
Residue:
250
  
Inhibitor
Name:
BDBM50048091
Synonyms:
CHEMBL3311520
Type:
Small organic molecule
Emp. Form.:
C23H25NO9S
Mol. Mass.:
491.511
SMILES:
Cc1ccc(cc1)S(=O)(=O)\N=c1/oc2ccccc2cc1CO[C@@H]1O[C@H](CO)[C@H](O)[C@H](O)[C@H]1O
: