Target
Kappa-type opioid receptor
Ligand
BDBM50048099
Substrate
Meas. Tech.
ChEMBL_1454649 (CHEMBL3361838)
EC50
434±n/a nM
Citation
 Kumar, VClark, MJTraynor, JRLewis, JWHusbands, SM Pyrrolo- and pyridomorphinans: non-selective opioid antagonists and delta opioid agonists/mu opioid partial agonists. Bioorg Med Chem 22:4067-72 (2014)  
Target
Name:
Kappa-type opioid receptor
Synonyms:
K-OR-1 Kappa-opioid receptor (KOR) Kappa-type opioid receptor (KOR) OPIATE Kappa OPRK1 kappa opioid receptor (KOR)
Type:
G Protein-Coupled Receptor (GPCR)
Mol. Mass.:
42648.76
Organism:
Homo sapiens (Human)
Description:
P41145
Residue:
380
  
Inhibitor
Name:
BDBM50048099
Synonyms:
CHEMBL3357966
Type:
Small organic molecule
Emp. Form.:
C30H32N2O6
Mol. Mass.:
516.5849
SMILES:
[H][C@@]12Oc3c4c(C[C@@]5([H])N(C)CC[C@@]14[C@@]5(O)Cc1c(CC(=O)OCC)c(O)n(Cc4ccccc4)c21)ccc3O
: