Target
Delta-type opioid receptor
Ligand
BDBM50048099
Substrate
Meas. Tech.
ChEMBL_1454652 (CHEMBL3361841)
EC50
43±n/a nM
Citation
 Kumar, VClark, MJTraynor, JRLewis, JWHusbands, SM Pyrrolo- and pyridomorphinans: non-selective opioid antagonists and delta opioid agonists/mu opioid partial agonists. Bioorg Med Chem 22:4067-72 (2014)  
Target
Name:
Delta-type opioid receptor
Synonyms:
D-OR-1 Delta opioid receptor OPIATE Delta OPRD1 OPRK1 | opioid receptor, delta 1
Type:
G Protein-Coupled Receptor (GPCR)
Mol. Mass.:
40382.98
Organism:
Homo sapiens (Human)
Description:
Competition binding assays were carried out using membrane preparations from transfected HN9.10 cells that constitutively expressed the delta opioid receptor.
Residue:
372
  
Inhibitor
Name:
BDBM50048099
Synonyms:
CHEMBL3357966
Type:
Small organic molecule
Emp. Form.:
C30H32N2O6
Mol. Mass.:
516.5849
SMILES:
[H][C@@]12Oc3c4c(C[C@@]5([H])N(C)CC[C@@]14[C@@]5(O)Cc1c(CC(=O)OCC)c(O)n(Cc4ccccc4)c21)ccc3O
: