Target
Heat shock protein HSP 90-beta
Ligand
BDBM50048366
Substrate
Meas. Tech.
ChEMBL_1446734 (CHEMBL3381049)
Ki
87±n/a nM
Citation
 Casale, EAmboldi, NBrasca, MGCaronni, DColombo, NDalvit, CFelder, ERFogliatto, GGalvani, AIsacchi, APolucci, PRiceputi, LSola, FVisco, CZuccotto, FCasuscelli, F Fragment-based hit discovery and structure-based optimization of aminotriazoloquinazolines as novel Hsp90 inhibitors. Bioorg Med Chem 22:4135-50 (2014)  
Target
Name:
Heat shock protein HSP 90-beta
Synonyms:
HS90B_HUMAN HSP 90 HSP90B HSPCB Heat shock protein HSP 90 (Hsp90)
Type:
Molecular Chaperone
Mol. Mass.:
83229.45
Organism:
Homo sapiens (Human)
Description:
P08238
Residue:
724
  
Inhibitor
Name:
BDBM50048366
Synonyms:
CHEMBL3309999
Type:
Small organic molecule
Emp. Form.:
C19H19N7O2
Mol. Mass.:
377.3999
SMILES:
NCCNc1ccc2c3nc(N)nn3c(Cc3ccc4OCOc4c3)nc2c1
: