Target
Heat shock protein HSP 90-beta
Ligand
BDBM50048380
Substrate
Meas. Tech.
ChEMBL_1446728 (CHEMBL3381043)
Ki
22700±n/a nM
Citation
 Casale, EAmboldi, NBrasca, MGCaronni, DColombo, NDalvit, CFelder, ERFogliatto, GGalvani, AIsacchi, APolucci, PRiceputi, LSola, FVisco, CZuccotto, FCasuscelli, F Fragment-based hit discovery and structure-based optimization of aminotriazoloquinazolines as novel Hsp90 inhibitors. Bioorg Med Chem 22:4135-50 (2014)  
Target
Name:
Heat shock protein HSP 90-beta
Synonyms:
HS90B_HUMAN HSP 90 HSP90B HSPCB Heat shock protein HSP 90 (Hsp90)
Type:
Molecular Chaperone
Mol. Mass.:
83229.45
Organism:
Homo sapiens (Human)
Description:
P08238
Residue:
724
  
Inhibitor
Name:
BDBM50048380
Synonyms:
CHEMBL3309720
Type:
Small organic molecule
Emp. Form.:
C13H15N5O
Mol. Mass.:
257.2911
SMILES:
CCCc1nc2c(OC)cccc2c2nc(N)nn12
: