Target
Inward rectifier potassium channel 2
Ligand
BDBM50312125
Substrate
Meas. Tech.
ChEMBL_1457498 (CHEMBL3367865)
IC50
>30000±n/a nM
Citation
 Flaherty, DPSimpson, DSMiller, MMaki, BEZou, BShi, JWu, MMcManus, OBAubé, JLi, MGolden, JE Potent and selective inhibitors of the TASK-1 potassium channel through chemical optimization of a bis-amide scaffold. Bioorg Med Chem Lett 24:3968-73 (2014)  
Target
Name:
Inward rectifier potassium channel 2
Synonyms:
Cardiac inward rectifier potassium channel IRK1 KCNJ2 Potassium channel, inwardly rectifying subfamily J member 2 | hIRK1
Type:
PROTEIN
Mol. Mass.:
48281.20
Organism:
Homo sapiens (Human)
Description:
ChEMBL_1515520
Residue:
427
  
Inhibitor
Name:
BDBM50312125
Synonyms:
3-chloro-N-(3-(3-methylbenzamido)phenyl)benzamide | CHEMBL1086899
Type:
Small organic molecule
Emp. Form.:
C21H17ClN2O2
Mol. Mass.:
364.825
SMILES:
Cc1cccc(c1)C(=O)Nc1cccc(NC(=O)c2cccc(Cl)c2)c1
: