Target
Inward rectifier potassium channel 2
Ligand
BDBM50050530
Substrate
Meas. Tech.
ChEMBL_1457498 (CHEMBL3367865)
IC50
>30000±n/a nM
Citation
 Flaherty, DPSimpson, DSMiller, MMaki, BEZou, BShi, JWu, MMcManus, OBAubé, JLi, MGolden, JE Potent and selective inhibitors of the TASK-1 potassium channel through chemical optimization of a bis-amide scaffold. Bioorg Med Chem Lett 24:3968-73 (2014)  
Target
Name:
Inward rectifier potassium channel 2
Synonyms:
Cardiac inward rectifier potassium channel IRK1 KCNJ2 Potassium channel, inwardly rectifying subfamily J member 2 | hIRK1
Type:
PROTEIN
Mol. Mass.:
48281.20
Organism:
Homo sapiens (Human)
Description:
ChEMBL_1515520
Residue:
427
  
Inhibitor
Name:
BDBM50050530
Synonyms:
CHEMBL3188857
Type:
Small organic molecule
Emp. Form.:
C22H17F3N2O2
Mol. Mass.:
398.3778
SMILES:
Cc1cccc(c1)C(=O)Nc1cccc(NC(=O)c2ccccc2C(F)(F)F)c1
: