Target
Polymerase basic protein 2
Ligand
BDBM50050714
Substrate
Meas. Tech.
ChEMBL_1458393 (CHEMBL3369823)
Kd
400±n/a nM
Citation
 Clark, MPLedeboer, MWDavies, IByrn, RAJones, SMPerola, ETsai, AJacobs, MNti-Addae, KBandarage, UKBoyd, MJBethiel, RSCourt, JJDeng, HDuffy, JPDorsch, WAFarmer, LJGao, HGu, WJackson, KJacobs, DHKennedy, JMLedford, BLiang, JMaltais, FMurcko, MWang, TWannamaker, MWBennett, HBLeeman, JRMcNeil, CTaylor, WPMemmott, CJiang, MRijnbrand, RBral, CGermann, UNezami, AZhang, YSalituro, FGBennani, YLCharifson, PS Discovery of a novel, first-in-class, orally bioavailable azaindole inhibitor (VX-787) of influenza PB2. J Med Chem 57:6668-78 (2014)  
Target
Name:
Polymerase basic protein 2
Synonyms:
PB2 Polymerase basic protein 2 | RNA-directed RNA polymerase subunit P3
Type:
PROTEIN
Mol. Mass.:
86120.80
Organism:
Influenza A virus (strain A/Puerto Rico/8/1934 H1N1)
Description:
ChEMBL_109460
Residue:
759
  
Inhibitor
Name:
BDBM50050714
Synonyms:
CHEMBL3317988
Type:
Small organic molecule
Emp. Form.:
C22H25F2N7O2
Mol. Mass.:
457.4764
SMILES:
Fc1cnc2[nH]cc(-c3ncc(F)c(N[C@H]4CCC[C@H](C4)NC(=O)N4CCOCC4)n3)c2c1
: