Target
L-lactate dehydrogenase A chain
Ligand
BDBM50052248
Substrate
Meas. Tech.
ChEMBL_1456604 (CHEMBL3369986)
Kd
3500±n/a nM
Citation
 Dragovich, PSFauber, BPBoggs, JChen, JCorson, LBDing, CZEigenbrot, CGe, HGiannetti, AMHunsaker, TLabadie, SLi, CLiu, YLiu, YMa, SMalek, SPeterson, DPitts, KEPurkey, HERobarge, KSalphati, LSideris, SUltsch, MVanderPorten, EWang, JWei, BXu, QYen, IYue, QZhang, HZhang, XZhou, A Identification of substituted 3-hydroxy-2-mercaptocyclohex-2-enones as potent inhibitors of human lactate dehydrogenase. Bioorg Med Chem Lett 24:3764-71 (2014)  
Target
Name:
L-lactate dehydrogenase A chain
Synonyms:
Cell proliferation-inducing gene 19 protein L-lactate dehydrogenase A Chain LDH-A LDHA Lactate dehydrogenase A (LDHA) | Renal carcinoma antigen NY-REN-59
Type:
Protein
Mol. Mass.:
36694.85
Organism:
Homo sapiens (Human)
Description:
P00338::PDB Code: 4ajp
Residue:
332
  
Inhibitor
Name:
BDBM50052248
Synonyms:
5-hydroxy-4-((2-nitrophenyl)thio)-1,6-dihydro-[1,1'-biphenyl]-3(2H)-one (1) | CHEMBL3318412
Type:
Small organic molecule
Emp. Form.:
C18H15NO4S
Mol. Mass.:
341.381
SMILES:
OC1=C(Sc2ccccc2[N+]([O-])=O)C(=O)CC(C1)c1ccccc1
: