Target
E3 ubiquitin-protein ligase Mdm2
Ligand
BDBM50053049
Substrate
Meas. Tech.
ChEMBL_1458455 (CHEMBL3370341)
IC50
0.091000±n/a nM
Citation
 Wang, YZhu, JLiu, JJChen, XMihalic, JDeignan, JYu, MSun, DKayser, FMcGee, LRLo, MCChen, AZhou, JYe, QHuang, XLong, AMYakowec, POliner, JDOlson, SHMedina, JC Optimization beyond AMG 232: discovery and SAR of sulfonamides on a piperidinone scaffold as potent inhibitors of the MDM2-p53 protein-protein interaction. Bioorg Med Chem Lett 24:3782-5 (2014)  
Target
Name:
E3 ubiquitin-protein ligase Mdm2
Synonyms:
Double minute 2 protein E3 ubiquitin-protein ligase Mdm2 (p53-binding protein Mdm2) Human Double Minute 2 (HDM2) MDM2-MDMX p53-Binding Protein MDM2 | p53-binding protein
Type:
Oncoprotein
Mol. Mass.:
55196.54
Organism:
Homo sapiens (Human)
Description:
Q00987
Residue:
491
  
Inhibitor
Name:
BDBM50053049
Synonyms:
CHEMBL3318764
Type:
Small organic molecule
Emp. Form.:
C29H36Cl2N2O5S
Mol. Mass.:
595.578
SMILES:
CC(C)(C)NS(=O)(=O)C[C@H](C1CC1)N1[C@@H]([C@H](C[C@](C)(CC(O)=O)C1=O)c1cccc(Cl)c1)c1ccc(Cl)cc1
: