Target
Acetylcholinesterase
Ligand
BDBM50053426
Substrate
Meas. Tech.
ChEMBL_1460145 (CHEMBL3369130)
IC50
216±n/a nM
Citation
 Darras, FHWehle, SHuang, GSotriffer, CADecker, M Amine substitution of quinazolinones leads to selective nanomolar AChE inhibitors with 'inverted' binding mode. Bioorg Med Chem 22:4867-81 (2014)  
Target
Name:
Acetylcholinesterase
Synonyms:
ACES_HUMAN Acetylcholinesterase (AChE) | Acetylcholinesterase (human AChE)
Type:
Enzyme
Mol. Mass.:
67792.70
Organism:
Homo sapiens (Human)
Description:
P22303
Residue:
614
  
Inhibitor
Name:
BDBM50053426
Synonyms:
CHEMBL3323042
Type:
Small organic molecule
Emp. Form.:
C24H27N3O2
Mol. Mass.:
389.4901
SMILES:
O=c1n2CCc3ccccc3-c2nc2ccc(OCCCN3CCCCC3)cc12
: